Reaction Details
TargetCoagulation factor XI
LigandBDBM50136609
Substrate/Competitorn/a
Meas. Tech.ChEMBL_1548350 (CHEMBL3756134)
Ki 17±n/a nM
Citation Smith, LMOrwat, MJHu, ZHan, WWang, CRossi, KAGilligan, PJPabbisetty, KBOsuna, HCorte, JRRendina, ARLuettgen, JMWong, PCNarayanan, RHarper, TWBozarth, JMCrain, EJWei, ARamamurthy, VMorin, PEXin, BZheng, JSeiffert, DAQuan, MLLam, PYWexler, RRPinto, DJ Novel phenylalanine derived diamides as Factor XIa inhibitors. Bioorg Med Chem Lett26:472-8 (2016) 
 
Coagulation factor XI
Name:Coagulation factor XI
Type:Enzyme
Mol. Mass.:70130.58
Organism:Homo sapiens (Human)
Description:P03951
Residue:625
BDBM50136609
NameBDBM50136609
Synonyms:CHEMBL3752772
TypeSmall organic molecule
Emp. Form.C27H23ClN6O4
Mol. Mass.530.962
SMILESOC(=O)Cc1ccc(NC(=O)[C@H](Cc2ccccc2)NC(=O)\C=C\c2cc(Cl)ccc2-n2cnnn2)cc1