Reaction Details
TargetPoly [ADP-ribose] polymerase tankyrase-1
LigandBDBM50136757
Substrate/Competitorn/a
Meas. Tech.ChEMBL_1548570 (CHEMBL3757227)
IC50 10965±n/a nM
Citation Haikarainen, TWaaler, JIgnatev, ANkizinkiko, YVenkannagari, HObaji, EKrauss, SLehtiö, L Development and structural analysis of adenosine site binding tankyrase inhibitors. Bioorg Med Chem Lett26:328-33 (2016) 
 
Poly [ADP-ribose] polymerase tankyrase-1
Name:Poly [ADP-ribose] polymerase tankyrase-1
Type:Enzyme
Mol. Mass.:142058.03
Organism:Homo sapiens (Human)
Description:O95271
Residue:1327
BDBM50136757
NameBDBM50136757
Synonyms:CHEMBL3753510
TypeSmall organic molecule
Emp. Form.C28H29ClN2O5
Mol. Mass.508.993
SMILESCOc1ccc(cc1)C(=O)Nc1ccc(C(=O)NCC2(CCOCC2)c2ccc(OC)cc2)c(Cl)c1