Reaction Details
TargetPoly [ADP-ribose] polymerase 2
LigandBDBM50136772
Substrate/Competitorn/a
Meas. Tech.ChEMBL_1548582 (CHEMBL3757401)
IC50>100000±n/a nM
Citation Haikarainen, TWaaler, JIgnatev, ANkizinkiko, YVenkannagari, HObaji, EKrauss, SLehtiö, L Development and structural analysis of adenosine site binding tankyrase inhibitors. Bioorg Med Chem Lett26:328-33 (2016) 
 
Poly [ADP-ribose] polymerase 2
Name:Poly [ADP-ribose] polymerase 2
Type:Enzyme
Mol. Mass.:66225.70
Organism:Homo sapiens (Human)
Description:Q9UGN5
Residue:583
BDBM50136772
NameBDBM50136772
Synonyms:CHEMBL3752492
TypeSmall organic molecule
Emp. Form.C25H19ClN4O3
Mol. Mass.458.896
SMILESCOc1ccc(cc1)C(=O)Nc1ccc(cc1)C(=O)N(c1ccncn1)c1ccccc1Cl