Reaction Details
TargetProtein mono-ADP-ribosyltransferase PARP10
LigandBDBM50136772
Substrate/Competitorn/a
Meas. Tech.ChEMBL_1548587 (CHEMBL3757406)
IC50>10000±n/a nM
Citation Haikarainen, TWaaler, JIgnatev, ANkizinkiko, YVenkannagari, HObaji, EKrauss, SLehtiö, L Development and structural analysis of adenosine site binding tankyrase inhibitors. Bioorg Med Chem Lett26:328-33 (2016) 
 
Protein mono-ADP-ribosyltransferase PARP10
Name:Protein mono-ADP-ribosyltransferase PARP10
Type:n/a
Mol. Mass.:109953.63
Organism:Homo sapiens (Human)
Description:Q53GL7
Residue:1025
BDBM50136772
NameBDBM50136772
Synonyms:CHEMBL3752492
TypeSmall organic molecule
Emp. Form.C25H19ClN4O3
Mol. Mass.458.896
SMILESCOc1ccc(cc1)C(=O)Nc1ccc(cc1)C(=O)N(c1ccncn1)c1ccccc1Cl