Reaction Details
TargetPoly [ADP-ribose] polymerase tankyrase-1
LigandBDBM50136777
Substrate/Competitorn/a
Meas. Tech.ChEMBL_1548570 (CHEMBL3757227)
IC50 1800±n/a nM
Citation Haikarainen, TWaaler, JIgnatev, ANkizinkiko, YVenkannagari, HObaji, EKrauss, SLehtiö, L Development and structural analysis of adenosine site binding tankyrase inhibitors. Bioorg Med Chem Lett26:328-33 (2016) 
 
Poly [ADP-ribose] polymerase tankyrase-1
Name:Poly [ADP-ribose] polymerase tankyrase-1
Type:Enzyme
Mol. Mass.:142058.03
Organism:Homo sapiens (Human)
Description:O95271
Residue:1327
BDBM50136777
NameBDBM50136777
Synonyms:CHEMBL3753077
TypeSmall organic molecule
Emp. Form.C25H26N2O5
Mol. Mass.434.4843
SMILESCOc1ccc(cc1)C1(CNC(=O)c2ccc(NC(=O)c3ccco3)cc2)CCOCC1