Reaction Details
TargetHistamine H1 receptor
LigandBDBM26392
Substrate/Competitorn/a
Meas. Tech.ChEMBL_1549480 (CHEMBL3755806)
Ki 9120±n/a nM
Citation Hammer, SGGobleder, SNaporra, FWittmann, HJElz, SHeinrich, MRStrasser, A 2,4-Diaminopyrimidines as dual ligands at the histamine H1 and H4 receptor-H1/H4-receptor selectivity. Bioorg Med Chem Lett26:292-300 (2016) 
 
Histamine H1 receptor
Name:Histamine H1 receptor
Type:G Protein-Coupled Receptor (GPCR)
Mol. Mass.:55808.72
Organism:Homo sapiens (Human)
Description:Cell pellets from SK-N-MC cells transfected with human H1 receptor were used in binding assay.
Residue:487
BDBM26392
NameBDBM26392
Synonyms:2,4-diamino-5,6-disubstituted pyrimidine, 6 | 6-(4-methylpiperazin-1-yl)-3,5-diazatricyclo[8.4.0.0^{2,7}]tetradeca-1(14),2,4,6,10,12-hexaen-4-amine
TypeSmall organic molecule
Emp. Form.C17H21N5
Mol. Mass.295.3821
SMILESCN1CCN(CC1)c1nc(N)nc-2c1CCc1ccccc-21