Reaction Details
TargetHistamine H4 receptor
LigandBDBM50137650
Substrate/Competitorn/a
Meas. Tech.ChEMBL_1549481 (CHEMBL3755807)
Ki 14454±n/a nM
Citation Hammer, SGGobleder, SNaporra, FWittmann, HJElz, SHeinrich, MRStrasser, A 2,4-Diaminopyrimidines as dual ligands at the histamine H1 and H4 receptor-H1/H4-receptor selectivity. Bioorg Med Chem Lett26:292-300 (2016) 
 
Histamine H4 receptor
Name:Histamine H4 receptor
Type:G Protein-Coupled Receptor (GPCR)
Mol. Mass.:44517.02
Organism:Homo sapiens (Human)
Description:Binding assays were using CHO cells stably expressing hH4R receptors.
Residue:390
BDBM50137650
NameBDBM50137650
Synonyms:CHEMBL3752885
TypeSmall organic molecule
Emp. Form.C24H27N5
Mol. Mass.385.5047
SMILESCN1CCN(CC1)c1nc(NCc2ccccc2)c2CCc3ccccc3-c2n1