Reaction Details
TargetHistamine H4 receptor
LigandBDBM50137649
Substrate/Competitorn/a
Meas. Tech.ChEMBL_1549481 (CHEMBL3755807)
Ki 15136±n/a nM
Citation Hammer, SGGobleder, SNaporra, FWittmann, HJElz, SHeinrich, MRStrasser, A 2,4-Diaminopyrimidines as dual ligands at the histamine H1 and H4 receptor-H1/H4-receptor selectivity. Bioorg Med Chem Lett26:292-300 (2016) 
 
Histamine H4 receptor
Name:Histamine H4 receptor
Type:G Protein-Coupled Receptor (GPCR)
Mol. Mass.:44517.02
Organism:Homo sapiens (Human)
Description:Binding assays were using CHO cells stably expressing hH4R receptors.
Residue:390
BDBM50137649
NameBDBM50137649
Synonyms:CHEMBL3753621
TypeSmall organic molecule
Emp. Form.C25H29N5
Mol. Mass.399.5313
SMILESCN1CCN(CC1)c1nc(NCCc2ccccc2)c2CCc3ccccc3-c2n1