Reaction Details
TargetHistamine H4 receptor
LigandBDBM50137640
Substrate/Competitorn/a
Meas. Tech.ChEMBL_1549481 (CHEMBL3755807)
Ki 13804±n/a nM
Citation Hammer, SGGobleder, SNaporra, FWittmann, HJElz, SHeinrich, MRStrasser, A 2,4-Diaminopyrimidines as dual ligands at the histamine H1 and H4 receptor-H1/H4-receptor selectivity. Bioorg Med Chem Lett26:292-300 (2016) 
 
Histamine H4 receptor
Name:Histamine H4 receptor
Type:G Protein-Coupled Receptor (GPCR)
Mol. Mass.:44517.02
Organism:Homo sapiens (Human)
Description:Binding assays were using CHO cells stably expressing hH4R receptors.
Residue:390
BDBM50137640
NameBDBM50137640
Synonyms:CHEMBL3752972
TypeSmall organic molecule
Emp. Form.C25H29N5O
Mol. Mass.415.5307
SMILESCOc1ccc(CNc2nc3CCc4ccccc4-c3c(n2)N2CCN(C)CC2)cc1