Reaction Details
TargetProstaglandin E2 receptor EP1 subtype
LigandBDBM50138044
Substrate/Competitorn/a
Meas. Tech.ChEMBL_1549764 (CHEMBL3757320)
Ki 1332±n/a nM
Citation Kinoshita, AHigashino, MAratani, YKakuuchi, AMatsuya, HOhmoto, K Discovery of highly potent dual EP(2) and EP(3) agonists with subtype selectivity. Bioorg Med Chem Lett26:1016-9 (2016) 
 
Prostaglandin E2 receptor EP1 subtype
Name:Prostaglandin E2 receptor EP1 subtype
Type:Enzyme
Mol. Mass.:41834.57
Organism:Homo sapiens (Human)
Description:P34995
Residue:402
BDBM50138044
NameBDBM50138044
Synonyms:CHEMBL3754197
TypeSmall organic molecule
Emp. Form.C24H34N2O5S2
Mol. Mass.494.667
SMILESO[C@H](\C=C\[C@H]1COC(=O)N1CCSc1nc(cs1)C(O)=O)C1(CCC2CCCCC2)CCC1