Reaction Details
TargetHistamine H3 receptor
LigandBDBM50138103
Substrate/Competitorn/a
Meas. Tech.ChEMBL_1549942 (CHEMBL3755089)
Ki 103±n/a nM
Citation Nirogi, RShinde, ATiriveedhi, VKota, LSaraf, SKBadange, RKMohammed, ARSubramanian, RMuddana, NBhyrapuneni, GAbraham, R Benzamide derivatives and their constrained analogs as histamine H3 receptor antagonists. Eur J Med Chem108:655-62 (2016) 
 
Histamine H3 receptor
Name:Histamine H3 receptor
Type:G Protein-Coupled Receptor (GPCR)
Mol. Mass.:48691.47
Organism:Homo sapiens (Human)
Description:Binding assays were using CHO cells stably expressing hH3R receptors.
Residue:445
BDBM50138103
NameBDBM50138103
Synonyms:CHEMBL3752696
TypeSmall organic molecule
Emp. Form.C19H28N2O3
Mol. Mass.332.4372
SMILESCC(C)N1CCC(C1)NC(=O)c1ccc(OC2CCOCC2)cc1