Reaction Details
TargetHistamine H3 receptor
LigandBDBM50138110
Substrate/Competitorn/a
Meas. Tech.ChEMBL_1549942 (CHEMBL3755089)
Ki 18±n/a nM
Citation Nirogi, RShinde, ATiriveedhi, VKota, LSaraf, SKBadange, RKMohammed, ARSubramanian, RMuddana, NBhyrapuneni, GAbraham, R Benzamide derivatives and their constrained analogs as histamine H3 receptor antagonists. Eur J Med Chem108:655-62 (2016) 
 
Histamine H3 receptor
Name:Histamine H3 receptor
Type:G Protein-Coupled Receptor (GPCR)
Mol. Mass.:48691.47
Organism:Homo sapiens (Human)
Description:Binding assays were using CHO cells stably expressing hH3R receptors.
Residue:445
BDBM50138110
NameBDBM50138110
Synonyms:CHEMBL3752796
TypeSmall organic molecule
Emp. Form.C23H34ClN3O2
Mol. Mass.419.988
SMILESCC(C)N1CCC(CC1)Oc1ccc(C(=O)NC2CCN(C2)C2CCC2)c(Cl)c1