Reaction Details
TargetHistamine H3 receptor
LigandBDBM50262939
Substrate/Competitorn/a
Meas. Tech.ChEMBL_1549945 (CHEMBL3755092)
Ki 6.8±n/a nM
Citation Nirogi, RShinde, ATiriveedhi, VKota, LSaraf, SKBadange, RKMohammed, ARSubramanian, RMuddana, NBhyrapuneni, GAbraham, R Benzamide derivatives and their constrained analogs as histamine H3 receptor antagonists. Eur J Med Chem108:655-62 (2016) 
 
Histamine H3 receptor
Name:Histamine H3 receptor
Type:G Protein-Coupled Receptor (GPCR)
Mol. Mass.:48691.47
Organism:Homo sapiens (Human)
Description:Binding assays were using CHO cells stably expressing hH3R receptors.
Residue:445
BDBM50262939
NameBDBM50262939
Synonyms:2-Methyl-3-(4-{[3-(1-pyrrolidinyl)propyl]oxy}phenyl)-5-(trifluoromethyl)-4(3H)-quinazolinone | CHEMBL476323
TypeSmall organic molecule
Emp. Form.C23H24F3N3O2
Mol. Mass.431.4508
SMILESCc1nc2cccc(c2c(=O)n1-c1ccc(OCCCN2CCCC2)cc1)C(F)(F)F