Reaction Details
TargetIndoleamine 2,3-dioxygenase 1
LigandBDBM50126145
Substrate/Competitorn/a
Meas. Tech.ChEMBL_1550107 (CHEMBL3756249)
IC50 468±n/a nM
Citation Peng, YHUeng, SHTseng, CTHung, MSSong, JSWu, JSLiao, FYFan, YSWu, MHHsiao, WCHsueh, CCLin, SYCheng, CYTu, CHLee, LCCheng, MFShia, KSShih, CWu, SY Important Hydrogen Bond Networks in Indoleamine 2,3-Dioxygenase 1 (IDO1) Inhibitor Design Revealed by Crystal Structures of Imidazoleisoindole Derivatives with IDO1. J Med Chem59:282-93 (2016) 
 
Indoleamine 2,3-dioxygenase 1
Name:Indoleamine 2,3-dioxygenase 1
Type:Enzyme
Mol. Mass.:45330.80
Organism:Homo sapiens (Human)
Description:P14902
Residue:403
BDBM50126145
NameBDBM50126145
Synonyms:CHEMBL3629570
TypeSmall organic molecule
Emp. Form.C18H20N2O
Mol. Mass.280.3642
SMILESO=C(CC1c2ccccc2-c2cncn12)C1CCCCC1