Reaction Details
TargetIndoleamine 2,3-dioxygenase 1
LigandBDBM50138818
Substrate/Competitorn/a
Meas. Tech.ChEMBL_1550107 (CHEMBL3756249)
IC50 279±n/a nM
Citation Peng, YHUeng, SHTseng, CTHung, MSSong, JSWu, JSLiao, FYFan, YSWu, MHHsiao, WCHsueh, CCLin, SYCheng, CYTu, CHLee, LCCheng, MFShia, KSShih, CWu, SY Important Hydrogen Bond Networks in Indoleamine 2,3-Dioxygenase 1 (IDO1) Inhibitor Design Revealed by Crystal Structures of Imidazoleisoindole Derivatives with IDO1. J Med Chem59:282-93 (2016) 
 
Indoleamine 2,3-dioxygenase 1
Name:Indoleamine 2,3-dioxygenase 1
Type:Enzyme
Mol. Mass.:45330.80
Organism:Homo sapiens (Human)
Description:P14902
Residue:403
BDBM50138818
NameBDBM50138818
Synonyms:CHEMBL3754460 | US10233190, Example 1356
TypeSmall organic molecule
Emp. Form.C18H19FN2O
Mol. Mass.298.3547
SMILESFc1cccc2-c3cncn3C(CC(=O)C3CCCCC3)c12