Reaction Details
TargetIndoleamine 2,3-dioxygenase 1
LigandBDBM50030791
Substrate/Competitorn/a
Meas. Tech.ChEMBL_1550111 (CHEMBL3756253)
IC50 3000±n/a nM
Citation Peng, YHUeng, SHTseng, CTHung, MSSong, JSWu, JSLiao, FYFan, YSWu, MHHsiao, WCHsueh, CCLin, SYCheng, CYTu, CHLee, LCCheng, MFShia, KSShih, CWu, SY Important Hydrogen Bond Networks in Indoleamine 2,3-Dioxygenase 1 (IDO1) Inhibitor Design Revealed by Crystal Structures of Imidazoleisoindole Derivatives with IDO1. J Med Chem59:282-93 (2016) 
 
Indoleamine 2,3-dioxygenase 1
Name:Indoleamine 2,3-dioxygenase 1
Type:Enzyme
Mol. Mass.:45330.80
Organism:Homo sapiens (Human)
Description:P14902
Residue:403
BDBM50030791
NameBDBM50030791
Synonyms:CHEMBL3342402
TypeSmall organic molecule
Emp. Form.C20H16N4O3S2
Mol. Mass.424.496
SMILESCc1ccc(cc1)-c1csc2nnc(SCC(=O)Nc3ccc4OCOc4c3)n12