Reaction Details
TargetMitogen-activated protein kinase 1
LigandBDBM50139004
Substrate/Competitorn/a
Meas. Tech.ChEMBL_1549980 (CHEMBL3755278)
IC50 82000±n/a nM
Citation Kinoshita, TSugiyama, HMori, YTakahashi, NTomonaga, A Identification of allosteric ERK2 inhibitors through in silico biased screening and competitive binding assay. Bioorg Med Chem Lett26:955-8 (2016) 
 
Mitogen-activated protein kinase 1
Name:Mitogen-activated protein kinase 1
Type:Ser/Thr Protein Kinase
Mol. Mass.:41392.76
Organism:Homo sapiens (Human)
Description:P28482
Residue:360
BDBM50139004
NameBDBM50139004
Synonyms:CHEMBL3752694
TypeSmall organic molecule
Emp. Form.C20H16FN3O4S2
Mol. Mass.445.487
SMILESCOc1cc2nc(NC(=O)c3csc(COc4ccc(F)cc4)n3)sc2cc1OC