Reaction Details
TargetAcetylcholinesterase
LigandBDBM50139007
Substrate/Competitorn/a
Meas. Tech.ChEMBL_1549986 (CHEMBL3755284)
Ki 22400±n/a nM
Citation Lemes, LFde Andrade Ramos, Gde Oliveira, ASda Silva, FMde Castro Couto, Gda Silva Boni, MGuimarães, MJSouza, INBartolini, MAndrisano, Vdo Nascimento Nogueira, PCSilveira, ERBrand, GDSoukup, OKorábecný, JRomeiro, NCCastro, NGBolognesi, MLRomeiro, LA Cardanol-derived AChE inhibitors: Towards the development of dual binding derivatives for Alzheimer's disease. Eur J Med Chem108:687-700 (2016) 
 
Acetylcholinesterase
Name:Acetylcholinesterase
Type:Enzyme
Mol. Mass.:71812.79
Organism:Electrophorus electricus (Electric eel)
Description:n/a
Residue:633
BDBM50139007
NameBDBM50139007
Synonyms:CHEMBL3754287
TypeSmall organic molecule
Emp. Form.C19H31NO
Mol. Mass.289.4555
SMILESCOc1cccc(CCCCCCCCN2CCCC2)c1