Reaction Details
TargetAcetylcholinesterase
LigandBDBM50139050
Substrate/Competitorn/a
Meas. Tech.ChEMBL_1549993 (CHEMBL3755444)
Ki 8600±n/a nM
Citation Lemes, LFde Andrade Ramos, Gde Oliveira, ASda Silva, FMde Castro Couto, Gda Silva Boni, MGuimarães, MJSouza, INBartolini, MAndrisano, Vdo Nascimento Nogueira, PCSilveira, ERBrand, GDSoukup, OKorábecný, JRomeiro, NCCastro, NGBolognesi, MLRomeiro, LA Cardanol-derived AChE inhibitors: Towards the development of dual binding derivatives for Alzheimer's disease. Eur J Med Chem108:687-700 (2016) 
 
Acetylcholinesterase
Name:Acetylcholinesterase
Type:Enzyme
Mol. Mass.:71812.79
Organism:Electrophorus electricus (Electric eel)
Description:n/a
Residue:633
BDBM50139050
NameBDBM50139050
Synonyms:CHEMBL3753906
TypeSmall organic molecule
Emp. Form.C22H36N2O3
Mol. Mass.376.5328
SMILESCOc1cccc(CCCCCCCCN2CCC(C2)OC(=O)N(C)C)c1