Reaction Details
TargetPantothenate synthetase
LigandBDBM50139062
Substrate/Competitorn/a
Meas. Tech.ChEMBL_1547921 (CHEMBL3756998)
IC50 1120±n/a nM
Citation Malothu, NBhandaru, JSKulandaivelu, UJojula, MAdidala, RRK R, UA V N, DKaki, VRAkkinepally, RR Synthesis, in vitro antimycobacterial evaluation and docking studies of some new 5,6,7,8-tetrahydropyrido[4',3':4,5]thieno[2,3-d]pyrimidin-4(3H)-one schiff bases. Bioorg Med Chem Lett26:836-40 (2016) 
 
Pantothenate synthetase
Name:Pantothenate synthetase
Type:n/a
Mol. Mass.:32675.10
Organism:Mycobacterium tuberculosis (strain ATCC 25618 / H37Rv)
Description:ChEMBL_102878
Residue:309
BDBM50139062
NameBDBM50139062
Synonyms:CHEMBL3752173
TypeSmall organic molecule
Emp. Form.C20H18N4O4S2
Mol. Mass.442.511
SMILESNC(=O)c1c(NC(=O)c2ccc(s2)[N+]([O-])=O)sc2CN(Cc3ccccc3)CCc12