Reaction Details
TargetCholinesterase
LigandBDBM50139066
Substrate/Competitorn/a
Meas. Tech.ChEBML_1549109
IC50 30670±n/a nM
Citation Sun, ZQTu, LXZhuo, FJLiu, SX Design and discovery of Novel Thiazole acetamide derivatives as anticholinesterase agent for possible role in the management of Alzheimer's. Bioorg Med Chem Lett26:747-50 (2016) 
 
Cholinesterase
Name:Cholinesterase
Type:Enzyme
Mol. Mass.:65643.35
Organism:Equus caballus (Horse)
Description:P81908
Residue:574
BDBM50139066
NameBDBM50139066
Synonyms:CHEMBL2403494
TypeSmall organic molecule
Emp. Form.C17H14N2OS
Mol. Mass.294.371
SMILESO=C(Cc1ccccc1)Nc1nc(cs1)-c1ccccc1