Reaction Details
TargetLysine-specific histone demethylase 1A
LigandBDBM50139119
Substrate/Competitorn/a
Meas. Tech.ChEBML_1552405
Ki 220±n/a nM
Citation Wu, FZhou, CYao, YWei, LFeng, ZDeng, LSong, Y 3-(Piperidin-4-ylmethoxy)pyridine Containing Compounds Are Potent Inhibitors of Lysine Specific Demethylase 1. J Med Chem59:253-63 (2016) 
 
Lysine-specific histone demethylase 1A
Name:Lysine-specific histone demethylase 1A
Type:Enzyme
Mol. Mass.:92901.01
Organism:Homo sapiens (Human)
Description:O60341
Residue:852
BDBM50139119
NameBDBM50139119
Synonyms:CHEMBL3758849
TypeSmall organic molecule
Emp. Form.C25H24FN3O
Mol. Mass.401.476
SMILESCc1ccc(cc1)-c1ncc(OCC2CCNCC2)cc1-c1ccc(cc1F)C#N