Reaction Details
TargetAmine oxidase [flavin-containing] B
LigandBDBM50142237
Substrate/Competitorn/a
Meas. Tech.ChEMBL_1552408 (CHEMBL3760808)
Ki 9700±n/a nM
Citation Wu, FZhou, CYao, YWei, LFeng, ZDeng, LSong, Y 3-(Piperidin-4-ylmethoxy)pyridine Containing Compounds Are Potent Inhibitors of Lysine Specific Demethylase 1. J Med Chem59:253-63 (2016) 
 
Amine oxidase [flavin-containing] B
Name:Amine oxidase [flavin-containing] B
Type:Protein
Mol. Mass.:58768.76
Organism:Homo sapiens (Human)
Description:P27338
Residue:520
BDBM50142237
NameBDBM50142237
Synonyms:CHEMBL3759797
TypeSmall organic molecule
Emp. Form.C25H22F3N3O
Mol. Mass.437.4569
SMILESFC(F)(F)c1ccc(cc1)-c1ncc(OCC2CCNCC2)cc1-c1ccc(cc1)C#N