Reaction Details
TargetAmine oxidase [flavin-containing] A
LigandBDBM50142187
Substrate/Competitorn/a
Meas. Tech.ChEMBL_1552407 (CHEMBL3760807)
Ki>50000±n/a nM
Citation Wu, FZhou, CYao, YWei, LFeng, ZDeng, LSong, Y 3-(Piperidin-4-ylmethoxy)pyridine Containing Compounds Are Potent Inhibitors of Lysine Specific Demethylase 1. J Med Chem59:253-63 (2016) 
 
Amine oxidase [flavin-containing] A
Name:Amine oxidase [flavin-containing] A
Type:Protein
Mol. Mass.:59689.53
Organism:Homo sapiens (Human)
Description:P21397
Residue:527
BDBM50142187
NameBDBM50142187
Synonyms:CHEMBL3758634
TypeSmall organic molecule
Emp. Form.C25H22F3N3O2
Mol. Mass.453.4563
SMILESFC(F)(F)Oc1ccc(cc1)-c1ncc(OCC2CCNCC2)cc1-c1ccc(cc1)C#N