Reaction Details
TargetNeuronal acetylcholine receptor subunit alpha-3/beta-4
LigandBDBM50143314
Substrate/Competitorn/a
Meas. Tech.ChEBML_1552370
Kd 0.300000±n/a nM
Citation Matera, CQuadri, MSciaccaluga, MPomè, DYFasoli, FDe Amici, MFucile, SGotti, CDallanoce, CGrazioso, G Modification of the anabaseine pyridine nucleus allows achieving binding and functional selectivity for thea3ß4 nicotinic acetylcholine receptor subtype. Eur J Med Chem108:392-405 (2016) 
 
Neuronal acetylcholine receptor subunit alpha-3/beta-4
Name:Neuronal acetylcholine receptor subunit alpha-3/beta-4
Type:n/a
Mol. Mass.:n/a
Description:ASSAY_ID of ChEMBL is 1970247
Components:This complex has 2 components.
Component 1
Name:Neuronal acetylcholine receptor subunit beta-4
Synonyms:ACHB4_HUMAN Cholinergic, Nicotinic Alpha6Beta3Beta4Alpha5 Nicotinic acetylcholine receptor alpha6/alpha3/beta4
Type:Enzyme Catalytic Domain
Mol. Mass.:56388.51
Organism:Homo sapiens (Human)
Description:Cholinergic, Nicotinic Alpha6Beta3Beta4Alpha5 0 HUMAN::P30926
Residue:498
Component 2
Name:Neuronal acetylcholine receptor subunit alpha-3
Synonyms:ACHA3_HUMAN Cholinergic, Nicotinic Alpha3Beta2 Cholinergic, Nicotinic Alpha3Beta4x NACHRA3 Neuronal acetylcholine receptor subunit alpha-3 nicotinic central
Type:Enzyme Catalytic Domain
Mol. Mass.:57479.03
Organism:Homo sapiens (Human)
Description:Cholinergic, Nicotinic Alpha3Beta2 0 HUMAN::P32297
Residue:505
BDBM50143314
NameBDBM50143314
Synonyms:(+)-Epibatidine (1R,2R,4S)-2-(6-Chloro-pyridin-3-yl)-7-aza-bicyclo[2.2.1]heptane CHEMBL298826 | EPIBATIDINE
TypeSmall organic molecule
Emp. Form.C11H13ClN2
Mol. Mass.208.687
SMILESClc1ccc(cn1)[C@H]1C[C@@H]2CC[C@H]1N2