Reaction Details
TargetNeuronal acetylcholine receptor subunit alpha-3/beta-4
LigandBDBM50140291
Substrate/Competitorn/a
Meas. Tech.ChEBML_1552364
Ki 4.7±n/a nM
Citation Matera, CQuadri, MSciaccaluga, MPomè, DYFasoli, FDe Amici, MFucile, SGotti, CDallanoce, CGrazioso, G Modification of the anabaseine pyridine nucleus allows achieving binding and functional selectivity for thea3ß4 nicotinic acetylcholine receptor subtype. Eur J Med Chem108:392-405 (2016) 
 
Neuronal acetylcholine receptor subunit alpha-3/beta-4
Name:Neuronal acetylcholine receptor subunit alpha-3/beta-4
Type:n/a
Mol. Mass.:n/a
Description:ASSAY_ID of ChEMBL is 1970247
Components:This complex has 2 components.
Component 1
Name:Neuronal acetylcholine receptor subunit beta-4
Synonyms:ACHB4_HUMAN Cholinergic, Nicotinic Alpha6Beta3Beta4Alpha5 Nicotinic acetylcholine receptor alpha6/alpha3/beta4
Type:Enzyme Catalytic Domain
Mol. Mass.:56388.51
Organism:Homo sapiens (Human)
Description:Cholinergic, Nicotinic Alpha6Beta3Beta4Alpha5 0 HUMAN::P30926
Residue:498
Component 2
Name:Neuronal acetylcholine receptor subunit alpha-3
Synonyms:ACHA3_HUMAN Cholinergic, Nicotinic Alpha3Beta2 Cholinergic, Nicotinic Alpha3Beta4x NACHRA3 Neuronal acetylcholine receptor subunit alpha-3 nicotinic central
Type:Enzyme Catalytic Domain
Mol. Mass.:57479.03
Organism:Homo sapiens (Human)
Description:Cholinergic, Nicotinic Alpha3Beta2 0 HUMAN::P32297
Residue:505
BDBM50140291
NameBDBM50140291
Synonyms:CHEMBL3758455
TypeSmall organic molecule
Emp. Form.C11H12IN
Mol. Mass.285.1242
SMILESIc1cccc(c1)C1=NCCCC1