Reaction Details
TargetNeuronal acetylcholine receptor subunit alpha-3/beta-4
LigandBDBM50142627
Substrate/Competitorn/a
Meas. Tech.ChEMBL_1552364 (CHEMBL3761528)
Ki 680±n/a nM
Citation Matera, CQuadri, MSciaccaluga, MPomè, DYFasoli, FDe Amici, MFucile, SGotti, CDallanoce, CGrazioso, G Modification of the anabaseine pyridine nucleus allows achieving binding and functional selectivity for thea3ß4 nicotinic acetylcholine receptor subtype. Eur J Med Chem108:392-405 (2016) 
 
Neuronal acetylcholine receptor subunit alpha-3/beta-4
Name:Neuronal acetylcholine receptor subunit alpha-3/beta-4
Type:n/a
Mol. Mass.:n/a
Description:ASSAY_ID of ChEMBL is 1970247
Components:This complex has 2 components.
Component 1
Name:Neuronal acetylcholine receptor subunit beta-4
Synonyms:ACHB4_HUMAN Cholinergic, Nicotinic Alpha6Beta3Beta4Alpha5 Nicotinic acetylcholine receptor alpha6/alpha3/beta4
Type:Enzyme Catalytic Domain
Mol. Mass.:56388.51
Organism:Homo sapiens (Human)
Description:Cholinergic, Nicotinic Alpha6Beta3Beta4Alpha5 0 HUMAN::P30926
Residue:498
Component 2
Name:Neuronal acetylcholine receptor subunit alpha-3
Synonyms:ACHA3_HUMAN Cholinergic, Nicotinic Alpha3Beta2 Cholinergic, Nicotinic Alpha3Beta4x NACHRA3 Neuronal acetylcholine receptor subunit alpha-3 nicotinic central
Type:Enzyme Catalytic Domain
Mol. Mass.:57479.03
Organism:Homo sapiens (Human)
Description:Cholinergic, Nicotinic Alpha3Beta2 0 HUMAN::P32297
Residue:505
BDBM50142627
NameBDBM50142627
Synonyms:CHEMBL3758367
TypeSmall organic molecule
Emp. Form.C11H13NO
Mol. Mass.175.227
SMILESOc1cccc(c1)C1=NCCCC1