Reaction Details
TargetNeuronal acetylcholine receptor subunit alpha-7
LigandBDBM50142626
Substrate/Competitorn/a
Meas. Tech.ChEMBL_1552366 (CHEMBL3761530)
Ki 821±n/a nM
Citation Matera, CQuadri, MSciaccaluga, MPomè, DYFasoli, FDe Amici, MFucile, SGotti, CDallanoce, CGrazioso, G Modification of the anabaseine pyridine nucleus allows achieving binding and functional selectivity for thea3ß4 nicotinic acetylcholine receptor subtype. Eur J Med Chem108:392-405 (2016) 
 
Neuronal acetylcholine receptor subunit alpha-7
Name:Neuronal acetylcholine receptor subunit alpha-7
Type:Enzyme
Mol. Mass.:56502.44
Organism:Rattus norvegicus (Rat)
Description:Q05941
Residue:502
BDBM50142626
NameBDBM50142626
Synonyms:CHEMBL3758480
TypeSmall organic molecule
Emp. Form.C12H14FNO
Mol. Mass.207.2441
SMILESOCc1cc(F)cc(c1)C1=NCCCC1