Reaction Details
TargetNeuronal acetylcholine receptor subunit alpha-4/beta-2
LigandBDBM50142624
Substrate/Competitorn/a
Meas. Tech.ChEMBL_1552365 (CHEMBL3761529)
Ki 2080±n/a nM
Citation Matera, CQuadri, MSciaccaluga, MPomè, DYFasoli, FDe Amici, MFucile, SGotti, CDallanoce, CGrazioso, G Modification of the anabaseine pyridine nucleus allows achieving binding and functional selectivity for thea3ß4 nicotinic acetylcholine receptor subtype. Eur J Med Chem108:392-405 (2016) 
 
Neuronal acetylcholine receptor subunit alpha-4/beta-2
Name:Neuronal acetylcholine receptor subunit alpha-4/beta-2
Type:n/a
Mol. Mass.:n/a
Description:n/a
Components:This complex has 0 components.
Component 1
Name:Neuronal acetylcholine receptor subunit alpha-4
Synonyms:ACHA4_RAT Cholinergic, Nicotinic Alpha4Beta2 Chrna4 Neuronal acetylcholine receptor (alpha4beta2 nAChR) Neuronal acetylcholine receptor subunit alpha 4 beta 2 | Neuronal acetylcholine receptor subunit alpha-4
Type:Enzyme
Mol. Mass.:70196.44
Organism:Rattus norvegicus (Rat)
Description:P09483
Residue:630
Component 2
Name:Neuronal acetylcholine receptor subunit beta-2
Synonyms:ACHB2_RAT Chrnb2 Neuronal acetylcholine receptor non-alpha-1 chain
Type:Enzyme
Mol. Mass.:56910.32
Organism:Rattus norvegicus (Rat)
Description:P12390
Residue:500
BDBM50142624
NameBDBM50142624
Synonyms:CHEMBL3759403
TypeSmall organic molecule
Emp. Form.C11H13N
Mol. Mass.159.2276
SMILESC1CCC(=NC1)c1ccccc1