Reaction Details
TargetReverse transcriptase
LigandBDBM50103642
Substrate/Competitorn/a
Meas. Tech.ChEMBL_1551159 (CHEMBL3761607)
IC50 3100±n/a nM
Citation Yang, JChen, WKang, DLu, XLi, XLiu, ZHuang, BDaelemans, DPannecouque, CDe Clercq, EZhan, PLiu, X Design, synthesis and anti-HIV evaluation of novel diarylpyridine derivatives targeting the entrance channel of NNRTI binding pocket. Eur J Med Chem109:294-304 (2016) 
 
Reverse transcriptase
Name:Reverse transcriptase
Synonyms:n/a
Type:Protein
Mol. Mass.:29598.37
Organism:Human immunodeficiency virus 1
Description:Q9WKE8
Residue:254
BDBM50103642
NameBDBM50103642
TypeSmall organic molecule
Emp. Form.C20H15BrN6O
Mol. Mass.435.277
SMILESCc1cc(cc(C)c1Oc1nc(Nc2ccc(cc2)C#N)nc(N)c1Br)C#N