Reaction Details
TargetCarbonic anhydrase 9
LigandBDBM50139130
Substrate/Competitorn/a
Meas. Tech.ChEBML_1551177
Ki 2.2±n/a nM
Citation Durgun, MTurkmen, HCeruso, MSupuran, CT Synthesis of 4-sulfamoylphenyl-benzylamine derivatives with inhibitory activity against human carbonic anhydrase isoforms I, II, IX and XII. Bioorg Med Chem24:982-8 (2016) 
 
Carbonic anhydrase 9
Name:Carbonic anhydrase 9
Type:Enzyme
Mol. Mass.:49669.03
Organism:Homo sapiens (Human)
Description:Catalytic domain of human cloned isozyme was used in the assay
Residue:459
BDBM50139130
NameBDBM50139130
Synonyms:CHEMBL3758586
TypeSmall organic molecule
Emp. Form.C13H12Cl2N2O3S
Mol. Mass.347.217
SMILESNS(=O)(=O)c1ccc(NCc2cc(Cl)cc(Cl)c2O)cc1