Reaction Details
TargetCarbonic anhydrase 1
LigandBDBM50229543
Substrate/Competitorn/a
Meas. Tech.ChEMBL_1551175 (CHEMBL3761623)
Ki>50000±n/a nM
Citation Durgun, MTurkmen, HCeruso, MSupuran, CT Synthesis of 4-sulfamoylphenyl-benzylamine derivatives with inhibitory activity against human carbonic anhydrase isoforms I, II, IX and XII. Bioorg Med Chem24:982-8 (2016) 
 
Carbonic anhydrase 1
Name:Carbonic anhydrase 1
Type:Enzyme
Mol. Mass.:28873.37
Organism:Homo sapiens (Human)
Description:P00915
Residue:261
BDBM50229543
NameBDBM50229543
Synonyms:4-(benzylideneamino)benzenesulfonamide CHEMBL408619
TypeSmall organic molecule
Emp. Form.C13H12N2O2S
Mol. Mass.260.312
SMILESNS(=O)(=O)c1ccc(cc1)\N=C\c1ccccc1