Reaction Details
TargetCarbonic anhydrase 1
LigandBDBM50013789
Substrate/Competitorn/a
Meas. Tech.ChEMBL_1551175 (CHEMBL3761623)
Ki 20±n/a nM
Citation Durgun, MTurkmen, HCeruso, MSupuran, CT Synthesis of 4-sulfamoylphenyl-benzylamine derivatives with inhibitory activity against human carbonic anhydrase isoforms I, II, IX and XII. Bioorg Med Chem24:982-8 (2016) 
 
Carbonic anhydrase 1
Name:Carbonic anhydrase 1
Type:Enzyme
Mol. Mass.:28873.37
Organism:Homo sapiens (Human)
Description:P00915
Residue:261
BDBM50013789
NameBDBM50013789
Synonyms:46 R.P Benzylsulfanilamide
TypeSmall organic molecule
Emp. Form.C13H14N2O2S
Mol. Mass.262.327
SMILESNS(=O)(=O)c1ccc(NCc2ccccc2)cc1