Reaction Details
TargetCarbonic anhydrase 9
LigandBDBM50371765
Substrate/Competitorn/a
Meas. Tech.ChEMBL_1551177 (CHEMBL3761625)
Ki 42±n/a nM
Citation Durgun, MTurkmen, HCeruso, MSupuran, CT Synthesis of 4-sulfamoylphenyl-benzylamine derivatives with inhibitory activity against human carbonic anhydrase isoforms I, II, IX and XII. Bioorg Med Chem24:982-8 (2016) 
 
Carbonic anhydrase 9
Name:Carbonic anhydrase 9
Type:Enzyme
Mol. Mass.:49669.03
Organism:Homo sapiens (Human)
Description:Catalytic domain of human cloned isozyme was used in the assay
Residue:459
BDBM50371765
NameBDBM50371765
Synonyms:CHEMBL270671
TypeSmall organic molecule
Emp. Form.C15H17N3O2S
Mol. Mass.303.379
SMILESCN(C)c1ccc(\C=N\c2ccc(cc2)S(N)(=O)=O)cc1