Reaction Details
TargetSerum paraoxonase/arylesterase 1
LigandBDBM50139132
Substrate/Competitorn/a
Meas. Tech.ChEBML_1552279
IC50 31410±n/a nM
Citation Karatas, MOUslu, HAlici, BGökçe, BGencer, NArslan, OArslan, NBÖzdemir, N Functionalized imidazolium and benzimidazolium salts as paraoxonase 1 inhibitors: Synthesis, characterization and molecular docking studies. Bioorg Med Chem24:1392-401 (2016) 
 
Serum paraoxonase/arylesterase 1
Name:Serum paraoxonase/arylesterase 1
Type:Enzyme
Mol. Mass.:39719.73
Organism:Homo sapiens (Human)
Description:P27169
Residue:355
BDBM50139132
NameBDBM50139132
Synonyms:CHEMBL1462074
TypeSmall organic molecule
Emp. Form.C12H11ClO2
Mol. Mass.222.668
SMILESCc1cc(C)c2c(CCl)cc(=O)oc2c1