Reaction Details
TargetSerum paraoxonase/arylesterase 1
LigandBDBM50144690
Substrate/Competitorn/a
Meas. Tech.ChEMBL_1552279 (CHEMBL3761350)
IC50 237500±n/a nM
Citation Karatas, MOUslu, HAlici, BGökçe, BGencer, NArslan, OArslan, NBÖzdemir, N Functionalized imidazolium and benzimidazolium salts as paraoxonase 1 inhibitors: Synthesis, characterization and molecular docking studies. Bioorg Med Chem24:1392-401 (2016) 
 
Serum paraoxonase/arylesterase 1
Name:Serum paraoxonase/arylesterase 1
Type:Enzyme
Mol. Mass.:39719.73
Organism:Homo sapiens (Human)
Description:P27169
Residue:355
BDBM50144690
NameBDBM50144690
Synonyms:CHEMBL3759001
TypeSmall organic molecule
Emp. Form.C26H22ClN5O2
Mol. Mass.471.938
SMILES[Cl-].Cc1ccc2c(C[n+]3cn(Cn4nnc5ccccc45)c4ccccc34)cc(=O)oc2c1C