Reaction Details
TargetSerum paraoxonase/arylesterase 1
LigandBDBM50144738
Substrate/Competitorn/a
Meas. Tech.ChEMBL_1552279 (CHEMBL3761350)
IC50 625710±n/a nM
Citation Karatas, MOUslu, HAlici, BGökçe, BGencer, NArslan, OArslan, NBÖzdemir, N Functionalized imidazolium and benzimidazolium salts as paraoxonase 1 inhibitors: Synthesis, characterization and molecular docking studies. Bioorg Med Chem24:1392-401 (2016) 
 
Serum paraoxonase/arylesterase 1
Name:Serum paraoxonase/arylesterase 1
Type:Enzyme
Mol. Mass.:39719.73
Organism:Homo sapiens (Human)
Description:P27169
Residue:355
BDBM50144738
NameBDBM50144738
Synonyms:CHEMBL3758838
TypeSmall organic molecule
Emp. Form.C13H15ClN4
Mol. Mass.262.738
SMILES[Cl-].Cc1n(C)cc[n+]1Cc1nc2ccccc2[nH]1