Reaction Details
TargetSerum paraoxonase/arylesterase 1
LigandBDBM50144740
Substrate/Competitorn/a
Meas. Tech.ChEMBL_1552279 (CHEMBL3761350)
IC50 564130±n/a nM
Citation Karatas, MOUslu, HAlici, BGökçe, BGencer, NArslan, OArslan, NBÖzdemir, N Functionalized imidazolium and benzimidazolium salts as paraoxonase 1 inhibitors: Synthesis, characterization and molecular docking studies. Bioorg Med Chem24:1392-401 (2016) 
 
Serum paraoxonase/arylesterase 1
Name:Serum paraoxonase/arylesterase 1
Type:Enzyme
Mol. Mass.:39719.73
Organism:Homo sapiens (Human)
Description:P27169
Residue:355
BDBM50144740
NameBDBM50144740
Synonyms:CHEMBL3758357
TypeSmall organic molecule
Emp. Form.C14H11N5
Mol. Mass.249.2706
SMILESC(n1cnc2ccccc12)n1nnc2ccccc12