Reaction Details
TargetL-lactate dehydrogenase B chain
LigandBDBM50144747
Substrate/Competitorn/a
Meas. Tech.ChEMBL_1555228 (CHEMBL3768544)
Ki 23200±n/a nM
Citation Rani, RKumar, V Recent Update on Human Lactate Dehydrogenase Enzyme 5 (hLDH5) Inhibitors: A Promising Approach for Cancer Chemotherapy. J Med Chem59:487-96 (2016) 
 
L-lactate dehydrogenase B chain
Name:L-lactate dehydrogenase B chain
Type:Oxidoreductase; homotetramer
Mol. Mass.:36635.55
Organism:Homo sapiens (Human)
Description:n/a
Residue:334
BDBM50144747
NameBDBM50144747
Synonyms:CHEMBL3763517
TypeSmall organic molecule
Emp. Form.C13H8O7
Mol. Mass.276.1984
SMILESOc1cc2C(=O)Cc3cc(O)c(=O)oc3-c2c(O)c1O