Reaction Details
TargetL-lactate dehydrogenase A chain
LigandBDBM50031638
Substrate/Competitorn/a
Meas. Tech.ChEMBL_1555230 (CHEMBL3768756)
Ki 3000±n/a nM
Citation Rani, RKumar, V Recent Update on Human Lactate Dehydrogenase Enzyme 5 (hLDH5) Inhibitors: A Promising Approach for Cancer Chemotherapy. J Med Chem59:487-96 (2016) 
 
L-lactate dehydrogenase A chain
Name:L-lactate dehydrogenase A chain
Type:Protein
Mol. Mass.:36694.85
Organism:Homo sapiens (Human)
Description:P00338::PDB Code: 4ajp
Residue:332
BDBM50031638
NameBDBM50031638
Synonyms:2,3-Dihydroxy-4-isopropyl-6-methyl-naphthalene-1-carboxylic acid | CHEMBL310405
TypeSmall organic molecule
Emp. Form.C15H16O4
Mol. Mass.260.2851
SMILESCC(C)c1c(O)c(O)c(C(O)=O)c2ccc(C)cc12