Reaction Details
TargetL-lactate dehydrogenase B chain
LigandBDBM50031638
Substrate/Competitorn/a
Meas. Tech.ChEMBL_1555231 (CHEMBL3768757)
Ki 92000±n/a nM
Citation Rani, RKumar, V Recent Update on Human Lactate Dehydrogenase Enzyme 5 (hLDH5) Inhibitors: A Promising Approach for Cancer Chemotherapy. J Med Chem59:487-96 (2016) 
 
L-lactate dehydrogenase B chain
Name:L-lactate dehydrogenase B chain
Type:Oxidoreductase; homotetramer
Mol. Mass.:36635.55
Organism:Homo sapiens (Human)
Description:n/a
Residue:334
BDBM50031638
NameBDBM50031638
Synonyms:2,3-Dihydroxy-4-isopropyl-6-methyl-naphthalene-1-carboxylic acid | CHEMBL310405
TypeSmall organic molecule
Emp. Form.C15H16O4
Mol. Mass.260.2851
SMILESCC(C)c1c(O)c(O)c(C(O)=O)c2ccc(C)cc12