Reaction Details
TargetL-lactate dehydrogenase B chain
LigandBDBM50066980
Substrate/Competitorn/a
Meas. Tech.ChEMBL_1555231 (CHEMBL3768757)
Ki 190000±n/a nM
Citation Rani, RKumar, V Recent Update on Human Lactate Dehydrogenase Enzyme 5 (hLDH5) Inhibitors: A Promising Approach for Cancer Chemotherapy. J Med Chem59:487-96 (2016) 
 
L-lactate dehydrogenase B chain
Name:L-lactate dehydrogenase B chain
Type:Oxidoreductase; homotetramer
Mol. Mass.:36635.55
Organism:Homo sapiens (Human)
Description:n/a
Residue:334
BDBM50066980
NameBDBM50066980
Synonyms:2,3-Dihydroxy-4,6,7-trimethyl-naphthalene-1-carboxylic acid | CHEMBL127334
TypeSmall organic molecule
Emp. Form.C14H14O4
Mol. Mass.246.2586
SMILESCc1cc2c(C)c(O)c(O)c(C(O)=O)c2cc1C