Reaction Details
TargetL-lactate dehydrogenase A chain
LigandBDBM50144776
Substrate/Competitorn/a
Meas. Tech.ChEMBL_1555230 (CHEMBL3768756)
Ki 30±n/a nM
Citation Rani, RKumar, V Recent Update on Human Lactate Dehydrogenase Enzyme 5 (hLDH5) Inhibitors: A Promising Approach for Cancer Chemotherapy. J Med Chem59:487-96 (2016) 
 
L-lactate dehydrogenase A chain
Name:L-lactate dehydrogenase A chain
Type:Protein
Mol. Mass.:36694.85
Organism:Homo sapiens (Human)
Description:P00338::PDB Code: 4ajp
Residue:332
BDBM50144776
NameBDBM50144776
Synonyms:CHEMBL3763437
TypeSmall organic molecule
Emp. Form.C22H22O4
Mol. Mass.350.4077
SMILESCC(C)c1c(O)c(O)c(C(O)=O)c2cc(c(C)cc12)-c1ccc(C)cc1