Reaction Details
TargetL-lactate dehydrogenase A chain
LigandBDBM23222
Substrate/Competitorn/a
Meas. Tech.ChEMBL_1555230 (CHEMBL3768756)
Ki 136000±n/a nM
Citation Rani, RKumar, V Recent Update on Human Lactate Dehydrogenase Enzyme 5 (hLDH5) Inhibitors: A Promising Approach for Cancer Chemotherapy. J Med Chem59:487-96 (2016) 
 
L-lactate dehydrogenase A chain
Name:L-lactate dehydrogenase A chain
Type:Protein
Mol. Mass.:36694.85
Organism:Homo sapiens (Human)
Description:P00338::PDB Code: 4ajp
Residue:332
BDBM23222
NameBDBM23222
Synonyms:Oxalamic acid Oxamate, 3 carbamoylformic acid
TypeSmall organic molecule
Emp. Form.C2H3NO3
Mol. Mass.89.0501
SMILESNC(=O)C(O)=O