Reaction Details
TargetL-lactate dehydrogenase A chain
LigandBDBM50144746
Substrate/Competitorn/a
Meas. Tech.ChEMBL_1555236 (CHEMBL3768762)
Ki 19500±n/a nM
Citation Rani, RKumar, V Recent Update on Human Lactate Dehydrogenase Enzyme 5 (hLDH5) Inhibitors: A Promising Approach for Cancer Chemotherapy. J Med Chem59:487-96 (2016) 
 
L-lactate dehydrogenase A chain
Name:L-lactate dehydrogenase A chain
Type:Protein
Mol. Mass.:36694.85
Organism:Homo sapiens (Human)
Description:P00338::PDB Code: 4ajp
Residue:332
BDBM50144746
NameBDBM50144746
Synonyms:CHEMBL3764862
TypeSmall organic molecule
Emp. Form.C22H20F3NO8
Mol. Mass.483.3913
SMILESOC[C@H]1O[C@@H](On2c(cc3c(cc(cc23)-c2ccccc2)C(F)(F)F)C(O)=O)[C@H](O)[C@@H](O)[C@@H]1O