Reaction Details
TargetL-lactate dehydrogenase B chain
LigandBDBM50066974
Substrate/Competitorn/a
Meas. Tech.ChEMBL_1555231 (CHEMBL3768757)
Ki 1000±n/a nM
Citation Rani, RKumar, V Recent Update on Human Lactate Dehydrogenase Enzyme 5 (hLDH5) Inhibitors: A Promising Approach for Cancer Chemotherapy. J Med Chem59:487-96 (2016) 
 
L-lactate dehydrogenase B chain
Name:L-lactate dehydrogenase B chain
Type:Oxidoreductase; homotetramer
Mol. Mass.:36635.55
Organism:Homo sapiens (Human)
Description:n/a
Residue:334
BDBM50066974
NameBDBM50066974
Synonyms:7-Benzyl-2,3-dihydroxy-6-methyl-4-propyl-naphthalene-1-carboxylic acid LDHA Inhibitor, 3
TypeSmall organic molecule
Emp. Form.C22H22O4
Mol. Mass.350.4077
SMILESCCCc1c(O)c(O)c(C(O)=O)c2cc(Cc3ccccc3)c(C)cc12