Reaction Details
TargetL-lactate dehydrogenase B chain
LigandBDBM23222
Substrate/Competitorn/a
Meas. Tech.ChEMBL_1555231 (CHEMBL3768757)
Ki 94400±n/a nM
Citation Rani, RKumar, V Recent Update on Human Lactate Dehydrogenase Enzyme 5 (hLDH5) Inhibitors: A Promising Approach for Cancer Chemotherapy. J Med Chem59:487-96 (2016) 
 
L-lactate dehydrogenase B chain
Name:L-lactate dehydrogenase B chain
Type:Oxidoreductase; homotetramer
Mol. Mass.:36635.55
Organism:Homo sapiens (Human)
Description:n/a
Residue:334
BDBM23222
NameBDBM23222
Synonyms:Oxalamic acid Oxamate, 3 carbamoylformic acid
TypeSmall organic molecule
Emp. Form.C2H3NO3
Mol. Mass.89.0501
SMILESNC(=O)C(O)=O