Reaction Details
TargetMetabotropic glutamate receptor 5
LigandBDBM50105838
Substrate/Competitorn/a
Meas. Tech.ChEBML_1553408
IC50 51±n/a nM
Citation Galambos, JDomány, GNógrádi, KWágner, GKeseru, GMBobok, AKolok, SMikó-Bakk, MLVastag, MSághy, KKóti, JSzakács, ZBéni, ZGál, KSzombathelyi, ZGreiner, I 4-Aryl-3-arylsulfonyl-quinolines as negative allosteric modulators of metabotropic GluR5 receptors: From HTS hit to development candidate. Bioorg Med Chem Lett26:1249-52 (2016) 
 
Metabotropic glutamate receptor 5
Name:Metabotropic glutamate receptor 5
Type:Enzyme
Mol. Mass.:132484.72
Organism:Homo sapiens (Human)
Description:n/a
Residue:1212
BDBM50105838
NameBDBM50105838
Synonyms:FENOBAM
TypeSmall organic molecule
Emp. Form.C11H11ClN4O2
Mol. Mass.266.684
SMILESCN1CC(=O)N=C1NC(=O)Nc1cccc(Cl)c1