Reaction Details
TargetAdenosine receptor A2a
LigandBDBM50139820
Substrate/Competitorn/a
Meas. Tech.ChEBML_1553861
Ki 6.7±n/a nM
Citation Zhou, GAslanian, RGallo, GKhan, TKuang, RPurakkattle, BDe Ruiz, MStamford, ATing, PWu, HWang, HXiao, DYu, TZhang, YMullins, DHodgson, R Discovery of aminoquinazoline derivatives as human A(2A) adenosine receptor antagonists. Bioorg Med Chem Lett26:1348-54 (2016) 
 
Adenosine receptor A2a
Name:Adenosine receptor A2a
Type:G Protein-Coupled Receptor (GPCR)
Mol. Mass.:44716.46
Organism:Homo sapiens (Human)
Description:P29274
Residue:412
BDBM50139820
NameBDBM50139820
Synonyms:CHEMBL3765268 | US10138212, Example 89
TypeSmall organic molecule
Emp. Form.C19H14FN5O
Mol. Mass.347.3458
SMILESNc1nc(C(=O)NCc2nccc3ccccc23)c2cccc(F)c2n1