Reaction Details
TargetAdenosine receptor A1
LigandBDBM50139748
Substrate/Competitorn/a
Meas. Tech.ChEBML_1553862
Ki 31±n/a nM
Citation Zhou, GAslanian, RGallo, GKhan, TKuang, RPurakkattle, BDe Ruiz, MStamford, ATing, PWu, HWang, HXiao, DYu, TZhang, YMullins, DHodgson, R Discovery of aminoquinazoline derivatives as human A(2A) adenosine receptor antagonists. Bioorg Med Chem Lett26:1348-54 (2016) 
 
Adenosine receptor A1
Name:Adenosine receptor A1
Type:G Protein-Coupled Receptor (GPCR)
Mol. Mass.:36520.92
Organism:Homo sapiens (Human)
Description:P30542
Residue:326
BDBM50139748
NameBDBM50139748
Synonyms:CHEMBL3763717
TypeSmall organic molecule
Emp. Form.C19H14FN5O
Mol. Mass.347.3458
SMILESNc1nc(C(=O)NCc2cccc3cccnc23)c2ccc(F)cc2n1